Skip to main content

pytest-sherlock

Build Status Cov PyPI PyPI - Python Version PyPI - Wheel

Pytest plugin which help to find coupled tests.

Sometimes we have coupled tests which depend from ordering

For example:

  • PASSES tests/exmaple/test_all_read.py tests/exmaple/test_b_modify.py tests/exmaple/test_c_delete.py
  • FAILED tests/exmaple/test_c_delete.py tests/exmaple/test_b_modify.py tests/exmaple/test_all_read.py

In this case pretty simple to detect coupled tests, but if we have >=1k tests which called before it will hard

Content:

Install

pip install pytest-sherlock

how to use:

pytest tests/exmaple/test_c_delete.py tests/exmaple/test_b_modify.py tests/exmaple/test_all_read.py --flaky-test="test_read_params" -vv

Plugin didn't run all tests, it try to find some possible guilty test and will run first

======================= test session starts =======================
collected 10 items                                                                                                                                                                                  
Try to find coupled tests
Step #1:
tests/exmaple/test_b_modify.py::test_modify_random_param PASSED                                                                                                                               [ 20%]
tests/exmaple/test_c_delete.py::test_delete_random_param PASSED                                                                                                                               [ 40%]
tests/exmaple/test_c_delete.py::test_deleted_passed PASSED                                                                                                                                    [ 60%]
tests/exmaple/test_c_delete.py::test_do_not_delete PASSED                                                                                                                                     [ 80%]
tests/exmaple/test_all_read.py::test_read_params COUPLED                                                                                                                                      [100%]
Step #2:
tests/exmaple/test_b_modify.py::test_modify_random_param PASSED                                                                                                                               [ 33%]
tests/exmaple/test_c_delete.py::test_delete_random_param PASSED                                                                                                                               [ 66%]
tests/exmaple/test_all_read.py::test_read_params COUPLED                                                                                                                                      [100%]
Step #3:
tests/exmaple/test_b_modify.py::test_modify_random_param PASSED                                                                                                                               [ 50%]
tests/exmaple/test_all_read.py::test_read_params COUPLED                                                                                                                                      [100%]

======================== found coupled in 0.08 seconds ========================
found coupled tests: 
         - tests/exmaple/test_b_modify.py::test_modify_random_param
         - tests/exmaple/test_all_read.py::test_read_params

pytest -l -vv tests/exmaple/test_b_modify.py::test_modify_random_param tests/exmaple/test_all_read.py::test_read_params
_____________________________ test_read_params __________________________________

config = {'a': 1, 'b': 13, 'c': 3}, param = 'b'

    def test_read_params(config, param):
>       assert config.get(param) == 2
E       AssertionError: assert 13 == 2
E        +  where 13 = <built-in method get of dict object at 0x107c464b0>('b')
E        +    where <built-in method get of dict object at 0x107c464b0> = {'a': 1, 'b': 13, 'c': 3}.get

tests/exmaple/test_all_read.py:8: AssertionError
======================= 7 passed, 3 coupled in 0.08 seconds ======================= 

TODO

I have a couple ideas, how to improve finder coupled tests:

  • use AST for detect common peace of code (variables, functions, etc...)
  • Also need to add tests for it =)

Metadata

Release files for pytest-sherlock 0.1.10

For a detailed explanation of source distributions (sdists) and built distributions (wheels), please see the package formats documentation.

Source distribution (sdist)

Source distribution for pytest-sherlock 0.1.10
File Size Uploaded
pytest-sherlock-0.1.10.tar.gz 6.1 kB Details

Built distribution (wheel)

Table of built distributions (wheels) for pytest-sherlock 0.1.10
File Interpreter ABI Platform
pytest_sherlock-0.1.10-py2-none-any.whl Python 2 none any Details

Total release size: 13.9 kB

Release files / pytest-sherlock-0.1.10.tar.gz

Download URL pytest-sherlock-0.1.10.tar.gz
Size 6.1 kB
Tags Source
SHA-256 checksum
How to use checksums
190705cd8c032ff2683f2ceafa30ee24c5788ea34682b86cc17155cd15f38063
BLAKE2b-256 checksum
How to use checksums
51cc60a6e8d1333b589698a8cda83166f4ec72ef5bb3f587dc79e557a45523d0
Upload date
Uploaded using Trusted Publishing?
What is trusted publishing?
No
Uploaded via twine/1.15.0 pkginfo/1.5.0.1 requests/2.22.0 setuptools/44.0.0 requests-toolbelt/0.9.1 tqdm/4.42.1 CPython/2.7.16

Release files / pytest_sherlock-0.1.10-py2-none-any.whl

Download URL pytest_sherlock-0.1.10-py2-none-any.whl
Size 7.8 kB
Tags Python 2
SHA-256 checksum
How to use checksums
7ab437c4644e4c490b22356f47395ec14688fb44083b1f9721bb5db72bccb713
BLAKE2b-256 checksum
How to use checksums
1611054ae539f6dad53e26c7e076b5049a4b93ac8fa98ade3efda5c25012d97a
Upload date
Uploaded using Trusted Publishing?
What is trusted publishing?
No
Uploaded via twine/1.15.0 pkginfo/1.5.0.1 requests/2.22.0 setuptools/44.0.0 requests-toolbelt/0.9.1 tqdm/4.42.1 CPython/2.7.16

Release history Release notifications | RSS feed

0.3.4

2 release files

0.3.1

2 release files

0.3.0

2 release files

0.2.4

2 release files

0.2.2

2 release files

0.2.1

2 release files

0.2.0

2 release files

This release

0.1.10 This release

2 release files

0.1.6

2 release files

0.1.5

2 release files

0.1.4

2 release files

0.1.3

2 release files

0.1.2

2 release files

0.1.1

2 release files

0.1.0

2 release files

0.0.1

2 release files

Anthropic, PBC Visionary sponsor Bloomberg Visionary sponsor Hudson River Trading Visionary sponsor Meta Visionary sponsor NVIDIA Visionary sponsor Microsoft Sustainability sponsor Depot Continuous Integration AWS Cloud computing and Security Sponsor Datadog Monitoring Fastly CDN Google Download Analytics Sentry Error logging StatusPage Status page