Skip to main content

pytest-sherlock

Build Status Cov PyPI PyPI - Python Version PyPI - Wheel

Pytest plugin which help to find coupled tests.

Sometimes we have coupled tests which depend from ordering

For example:

  • PASSES tests/exmaple/test_all_read.py tests/exmaple/test_b_modify.py tests/exmaple/test_c_delete.py
  • FAILED tests/exmaple/test_c_delete.py tests/exmaple/test_b_modify.py tests/exmaple/test_all_read.py

In this case pretty simple to detect coupled tests, but if we have >=1k tests which called before it will hard

Content:

Install

pip install pytest-sherlock

how to use:

pytest tests/exmaple/test_c_delete.py tests/exmaple/test_b_modify.py tests/exmaple/test_all_read.py --flaky-test="test_read_params" -vv

Plugin didn't run all tests, it try to find some possible guilty test and will run first

Try to find coupled tests in [3-4] steps
__________________________ Step [1 of 4]: __________________________

tests/exmaple/test_c_delete.py::test_delete_random_param PASSED                                                                                                      [ 20%]
tests/exmaple/test_b_modify.py::test_modify_random_param PASSED                                                                                                      [ 40%]
tests/exmaple/test_c_delete.py::test_deleted_passed PASSED                                                                                                           [ 60%]
tests/exmaple/test_c_delete.py::test_do_not_delete PASSED                                                                                                            [ 80%]
tests/exmaple/test_all_read.py::test_read_params COUPLED                                                                                                             [100%]
__________________________ Step [2 of 4]: __________________________

tests/exmaple/test_c_delete.py::test_delete_random_param PASSED                                                                                                      [ 33%]
tests/exmaple/test_b_modify.py::test_modify_random_param PASSED                                                                                                      [ 66%]
tests/exmaple/test_all_read.py::test_read_params COUPLED                                                                                                             [100%]
__________________________ Step [3 of 4]: __________________________

tests/exmaple/test_c_delete.py::test_delete_random_param PASSED                                                                                                      [ 50%]
tests/exmaple/test_all_read.py::test_read_params PASSED                                                                                                              [100%]
__________________________ Step [4 of 4]: __________________________

tests/exmaple/test_b_modify.py::test_modify_random_param PASSED                                                                                                      [ 50%]
tests/exmaple/test_all_read.py::test_read_params COUPLED                                                                                                             [100%]

=================== found coupled in 0.08 seconds ===================
Found coupled tests:
tests/exmaple/test_b_modify.py::test_modify_random_param
tests/exmaple/test_all_read.py::test_read_params

Common fixtures:
config

How to reproduce:
pytest -l -vv tests/exmaple/test_b_modify.py::test_modify_random_param tests/exmaple/test_all_read.py::test_read_params
__________________________ test_read_params __________________________

config = {'a': 1, 'b': 13, 'c': 3}, param = 'b'

    def test_read_params(config, param):
>       assert config.get(param) == 2
E       AssertionError: assert 13 == 2
E        +  where 13 = <built-in method get of dict object at 0x10ef1ed70>('b')
E        +    where <built-in method get of dict object at 0x10ef1ed70> = {'a': 1, 'b': 13, 'c': 3}.get

tests/exmaple/test_all_read.py:8: AssertionError
=================== 9 passed, 3 coupled in 0.08 seconds ===================

TODO

I have a couple ideas, how to improve finder coupled tests:

  • use AST for detect common peace of code (variables, functions, etc...)
  • Also need to add tests for it =)

Metadata

Release files for pytest-sherlock 0.1.16

For a detailed explanation of source distributions (sdists) and built distributions (wheels), please see the package formats documentation.

Source distribution (sdist)

Source distribution for pytest-sherlock 0.1.16
File Size Uploaded
pytest-sherlock-0.1.16.tar.gz 7.2 kB Details

Built distribution (wheel)

Table of built distributions (wheels) for pytest-sherlock 0.1.16
File Interpreter ABI Platform
pytest_sherlock-0.1.16-py2-none-any.whl Python 2 none any Details

Total release size: 15.6 kB

Release files / pytest-sherlock-0.1.16.tar.gz

Download URL pytest-sherlock-0.1.16.tar.gz
Size 7.2 kB
Tags Source
SHA-256 checksum
How to use checksums
bb036eb37acb4bc77e46e15cd55e5b075f29b4e639d1719a0a1b90639d5e77cc
BLAKE2b-256 checksum
How to use checksums
5ed2132f71e07080444ffaea458fa14588cdc9c0016ecb224fd04636b9879d26
Upload date
Uploaded using Trusted Publishing?
What is trusted publishing?
No
Uploaded via twine/1.15.0 pkginfo/1.5.0.1 requests/2.24.0 setuptools/44.1.1 requests-toolbelt/0.9.1 tqdm/4.47.0 CPython/2.7.15

Release files / pytest_sherlock-0.1.16-py2-none-any.whl

Download URL pytest_sherlock-0.1.16-py2-none-any.whl
Size 8.5 kB
Tags Python 2
SHA-256 checksum
How to use checksums
8577aa61a075b06e6dad8ae2ef6345ee4bafe041dda201c870c0e0481abdb780
BLAKE2b-256 checksum
How to use checksums
a4e79bbc336d7dd57384f7116b434cee8e807ab64b5de7141733777a0042fd14
Upload date
Uploaded using Trusted Publishing?
What is trusted publishing?
No
Uploaded via twine/1.15.0 pkginfo/1.5.0.1 requests/2.24.0 setuptools/44.1.1 requests-toolbelt/0.9.1 tqdm/4.47.0 CPython/2.7.15

Release history Release notifications | RSS feed

0.3.4

2 release files

0.3.1

2 release files

0.3.0

2 release files

0.2.4

2 release files

0.2.2

2 release files

0.2.1

2 release files

0.2.0

2 release files

This release

0.1.16 This release

2 release files

0.1.6

2 release files

0.1.5

2 release files

0.1.4

2 release files

0.1.3

2 release files

0.1.2

2 release files

0.1.1

2 release files

0.1.0

2 release files

0.0.1

2 release files

Anthropic, PBC Visionary sponsor Bloomberg Visionary sponsor Hudson River Trading Visionary sponsor Meta Visionary sponsor NVIDIA Visionary sponsor Microsoft Sustainability sponsor Depot Continuous Integration AWS Cloud computing and Security Sponsor Datadog Monitoring Fastly CDN Google Download Analytics Sentry Error logging StatusPage Status page