pytest-sherlock
Pytest plugin which help to find coupled tests.
Sometimes we have coupled tests which depend from ordering
For example:
- PASSES
tests/exmaple/test_all_read.py tests/exmaple/test_b_modify.py tests/exmaple/test_c_delete.py - FAILED
tests/exmaple/test_c_delete.py tests/exmaple/test_b_modify.py tests/exmaple/test_all_read.py
In this case pretty simple to detect coupled tests, but if we have >=1k tests which called before it will hard
Content:
Install
pip install pytest-sherlock
how to use:
pytest tests/exmaple/test_c_delete.py tests/exmaple/test_b_modify.py tests/exmaple/test_all_read.py --flaky-test="test_read_params" -vv
Plugin didn't run all tests, it try to find some possible guilty test and will run first
Try to find coupled tests in [3-4] steps
__________________________ Step [1 of 4]: __________________________
tests/exmaple/test_c_delete.py::test_delete_random_param PASSED [ 20%]
tests/exmaple/test_b_modify.py::test_modify_random_param PASSED [ 40%]
tests/exmaple/test_c_delete.py::test_deleted_passed PASSED [ 60%]
tests/exmaple/test_c_delete.py::test_do_not_delete PASSED [ 80%]
tests/exmaple/test_all_read.py::test_read_params FAILED [100%]
__________________________ Step [2 of 4]: __________________________
tests/exmaple/test_c_delete.py::test_delete_random_param PASSED [ 33%]
tests/exmaple/test_b_modify.py::test_modify_random_param PASSED [ 66%]
tests/exmaple/test_all_read.py::test_read_params FAILED [100%]
__________________________ Step [3 of 4]: __________________________
tests/exmaple/test_c_delete.py::test_delete_random_param PASSED [ 50%]
tests/exmaple/test_all_read.py::test_read_params PASSED [100%]
__________________________ Step [4 of 4]: __________________________
tests/exmaple/test_b_modify.py::test_modify_random_param PASSED [ 50%]
tests/exmaple/test_all_read.py::test_read_params FAILED [100%]
============================== FAILURES ==============================
__________________________ test_read_params __________________________
Found coupled tests:
tests/exmaple/test_b_modify.py::test_modify_random_param
tests/exmaple/test_all_read.py::test_read_params
Common fixtures:
config
How to reproduce:
pytest -l -vv tests/exmaple/test_b_modify.py::test_modify_random_param tests/exmaple/test_all_read.py::test_read_params
AssertionError: assert 13 == 2
+ where 13 = <built-in method get of dict object at 0x102664280>('b')
+ where <built-in method get of dict object at 0x102664280> = {'a': 1, 'b': 13, 'c': 3}.get
tests/exmaple/test_all_read.py:8: AssertionError
=================== 1 failed, 9 passed in 0.08 seconds ===================
TODO
I have a couple ideas, how to improve finder coupled tests:
- use AST for detect common peace of code (variables, functions, etc...)
Metadata
Release files for pytest-sherlock 0.2.0
For a detailed explanation of source distributions (sdists) and built distributions (wheels), please see the package formats documentation.
Source distribution (sdist)
| File | Size | Uploaded | |
|---|---|---|---|
| pytest-sherlock-0.2.0.tar.gz | 7.2 kB | Details |
Built distribution (wheel)
| File | Interpreter | ABI | Platform | Reset |
|---|---|---|---|---|
| pytest_sherlock-0.2.0-py2-none-any.whl | Python 2 | none | any | Details |
Total release size: 15.9 kB
Release files / pytest-sherlock-0.2.0.tar.gz
| Download URL | pytest-sherlock-0.2.0.tar.gz |
|---|---|
| Size | 7.2 kB |
| Tags | Source |
|
SHA-256 checksum How to use checksums |
97e51dc300d68d6db21fd860a6a4ee444f6a6f38b56eed752a70ad33f01bcc3e
|
|
BLAKE2b-256 checksum How to use checksums |
a19a2db3ce79d4583dfa3e7fec97ae42ae39574a1074bc6e72ce463918435852
|
| Upload date | |
|
Uploaded using Trusted Publishing? What is trusted publishing? |
No |
| Uploaded via |
twine/1.15.0 pkginfo/1.5.0.1 requests/2.24.0 setuptools/44.1.1 requests-toolbelt/0.9.1 tqdm/4.47.0 CPython/2.7.15
|
Release files / pytest_sherlock-0.2.0-py2-none-any.whl
| Download URL | pytest_sherlock-0.2.0-py2-none-any.whl |
|---|---|
| Size | 8.7 kB |
| Tags | Python 2 |
|
SHA-256 checksum How to use checksums |
a63216adfb78ba55b6b6f5a62a7cf591edb141e1053b8c59ec01fa6c211e8808
|
|
BLAKE2b-256 checksum How to use checksums |
1eb56d936e37413d8457ae9db1ae965f4aa6b81257bd2523efaa606c738e9923
|
| Upload date | |
|
Uploaded using Trusted Publishing? What is trusted publishing? |
No |
| Uploaded via |
twine/1.15.0 pkginfo/1.5.0.1 requests/2.24.0 setuptools/44.1.1 requests-toolbelt/0.9.1 tqdm/4.47.0 CPython/2.7.15
|