Skip to main content

pytest-sherlock

Build Status Cov PyPI PyPI - Python Version PyPI - Wheel

Pytest plugin which help to find coupled tests.

Sometimes we have coupled tests which depend from ordering

For example:

  • PASSES tests/exmaple/test_all_read.py tests/exmaple/test_b_modify.py tests/exmaple/test_c_delete.py
  • FAILED tests/exmaple/test_c_delete.py tests/exmaple/test_b_modify.py tests/exmaple/test_all_read.py

In this case pretty simple to detect coupled tests, but if we have >=1k tests which called before it will hard

Content:

Install

pip install pytest-sherlock

how to use:

pytest tests/exmaple/test_c_delete.py tests/exmaple/test_b_modify.py tests/exmaple/test_all_read.py --flaky-test="test_read_params" -vv

Plugin didn't run all tests, it try to find some possible guilty test and will run first

Try to find coupled tests in [3-4] steps
__________________________ Step [1 of 4]: __________________________

tests/exmaple/test_c_delete.py::test_delete_random_param PASSED                                                                                                      [ 20%]
tests/exmaple/test_b_modify.py::test_modify_random_param PASSED                                                                                                      [ 40%]
tests/exmaple/test_c_delete.py::test_deleted_passed PASSED                                                                                                           [ 60%]
tests/exmaple/test_c_delete.py::test_do_not_delete PASSED                                                                                                            [ 80%]
tests/exmaple/test_all_read.py::test_read_params FAILED                                                                                                             [100%]
__________________________ Step [2 of 4]: __________________________

tests/exmaple/test_c_delete.py::test_delete_random_param PASSED                                                                                                      [ 33%]
tests/exmaple/test_b_modify.py::test_modify_random_param PASSED                                                                                                      [ 66%]
tests/exmaple/test_all_read.py::test_read_params FAILED                                                                                                             [100%]
__________________________ Step [3 of 4]: __________________________

tests/exmaple/test_c_delete.py::test_delete_random_param PASSED                                                                                                      [ 50%]
tests/exmaple/test_all_read.py::test_read_params PASSED                                                                                                              [100%]
__________________________ Step [4 of 4]: __________________________

tests/exmaple/test_b_modify.py::test_modify_random_param PASSED                                                                                                      [ 50%]
tests/exmaple/test_all_read.py::test_read_params FAILED                                                                                                             [100%]

============================== FAILURES ==============================
__________________________ test_read_params __________________________

Found coupled tests:
tests/exmaple/test_b_modify.py::test_modify_random_param
tests/exmaple/test_all_read.py::test_read_params

Common fixtures:
config

How to reproduce:
pytest -l -vv tests/exmaple/test_b_modify.py::test_modify_random_param tests/exmaple/test_all_read.py::test_read_params


AssertionError: assert 13 == 2
 +  where 13 = <built-in method get of dict object at 0x102664280>('b')
 +    where <built-in method get of dict object at 0x102664280> = {'a': 1, 'b': 13, 'c': 3}.get

tests/exmaple/test_all_read.py:8: AssertionError
=================== 1 failed, 9 passed in 0.08 seconds ===================

TODO

I have a couple ideas, how to improve finder coupled tests:

  • use AST for detect common peace of code (variables, functions, etc...)

Metadata

Release files for pytest-sherlock 0.2.2

For a detailed explanation of source distributions (sdists) and built distributions (wheels), please see the package formats documentation.

Source distribution (sdist)

Source distribution for pytest-sherlock 0.2.2
File Size Uploaded
pytest-sherlock-0.2.2.tar.gz 7.5 kB Details

Built distribution (wheel)

Table of built distributions (wheels) for pytest-sherlock 0.2.2
File Interpreter ABI Platform
pytest_sherlock-0.2.2-py2-none-any.whl Python 2 none any Details

Total release size: 16.4 kB

Release files / pytest-sherlock-0.2.2.tar.gz

Download URL pytest-sherlock-0.2.2.tar.gz
Size 7.5 kB
Tags Source
SHA-256 checksum
How to use checksums
f44f78a2a6891543c706044b8b6622c342759f145538a6b15c96a9fdc792ca7f
BLAKE2b-256 checksum
How to use checksums
5826ef6530f48670ff3f96b21b029cf1855c61fc249c1760ed6e4d499b1f7679
Upload date
Uploaded using Trusted Publishing?
What is trusted publishing?
No
Uploaded via twine/1.15.0 pkginfo/1.5.0.1 requests/2.24.0 setuptools/44.1.1 requests-toolbelt/0.9.1 tqdm/4.47.0 CPython/2.7.15

Release files / pytest_sherlock-0.2.2-py2-none-any.whl

Download URL pytest_sherlock-0.2.2-py2-none-any.whl
Size 8.9 kB
Tags Python 2
SHA-256 checksum
How to use checksums
7361fce980ab6db0d9e7ce0506f975c38890f0969c93760a1c89a2046186b781
BLAKE2b-256 checksum
How to use checksums
d6dd8bad5ce11e599c7f840e23eda1b035bb917821fa1346bc72dffcb3d468d0
Upload date
Uploaded using Trusted Publishing?
What is trusted publishing?
No
Uploaded via twine/1.15.0 pkginfo/1.5.0.1 requests/2.24.0 setuptools/44.1.1 requests-toolbelt/0.9.1 tqdm/4.47.0 CPython/2.7.15

Release history Release notifications | RSS feed

0.3.4

2 release files

0.3.1

2 release files

0.3.0

2 release files

0.2.4

2 release files

This release

0.2.2 This release

2 release files

0.2.1

2 release files

0.2.0

2 release files

0.1.6

2 release files

0.1.5

2 release files

0.1.4

2 release files

0.1.3

2 release files

0.1.2

2 release files

0.1.1

2 release files

0.1.0

2 release files

0.0.1

2 release files

Anthropic, PBC Visionary sponsor Bloomberg Visionary sponsor Hudson River Trading Visionary sponsor Meta Visionary sponsor NVIDIA Visionary sponsor Microsoft Sustainability sponsor Depot Continuous Integration AWS Cloud computing and Security Sponsor Datadog Monitoring Fastly CDN Google Download Analytics Sentry Error logging StatusPage Status page