pytest-sherlock
Pytest plugin which help to find coupled tests.
Sometimes we have coupled tests which depend from ordering
For example:
- PASSES
tests/exmaple/test_all_read.py tests/exmaple/test_b_modify.py tests/exmaple/test_c_delete.py - FAILED
tests/exmaple/test_c_delete.py tests/exmaple/test_b_modify.py tests/exmaple/test_all_read.py
In this case pretty simple to detect coupled tests, but if we have >=1k tests which called before it will hard
Content:
Install
pip install pytest-sherlock
how to use:
pytest tests/exmaple/test_c_delete.py tests/exmaple/test_b_modify.py tests/exmaple/test_all_read.py --flaky-test="test_read_params" -vv
Plugin didn't run all tests, it try to find some possible guilty test and will run first
Try to find coupled tests in [3-4] steps
__________________________ Step [1 of 4]: __________________________
tests/exmaple/test_c_delete.py::test_delete_random_param PASSED [ 20%]
tests/exmaple/test_b_modify.py::test_modify_random_param PASSED [ 40%]
tests/exmaple/test_c_delete.py::test_deleted_passed PASSED [ 60%]
tests/exmaple/test_c_delete.py::test_do_not_delete PASSED [ 80%]
tests/exmaple/test_all_read.py::test_read_params FAILED [100%]
__________________________ Step [2 of 4]: __________________________
tests/exmaple/test_c_delete.py::test_delete_random_param PASSED [ 33%]
tests/exmaple/test_b_modify.py::test_modify_random_param PASSED [ 66%]
tests/exmaple/test_all_read.py::test_read_params FAILED [100%]
__________________________ Step [3 of 4]: __________________________
tests/exmaple/test_c_delete.py::test_delete_random_param PASSED [ 50%]
tests/exmaple/test_all_read.py::test_read_params PASSED [100%]
__________________________ Step [4 of 4]: __________________________
tests/exmaple/test_b_modify.py::test_modify_random_param PASSED [ 50%]
tests/exmaple/test_all_read.py::test_read_params FAILED [100%]
============================== FAILURES ==============================
__________________________ test_read_params __________________________
Found coupled tests:
tests/exmaple/test_b_modify.py::test_modify_random_param
tests/exmaple/test_all_read.py::test_read_params
Common fixtures:
config
How to reproduce:
pytest -l -vv tests/exmaple/test_b_modify.py::test_modify_random_param tests/exmaple/test_all_read.py::test_read_params
AssertionError: assert 13 == 2
+ where 13 = <built-in method get of dict object at 0x102664280>('b')
+ where <built-in method get of dict object at 0x102664280> = {'a': 1, 'b': 13, 'c': 3}.get
tests/exmaple/test_all_read.py:8: AssertionError
=================== 1 failed, 9 passed in 0.08 seconds ===================
TODO
I have a couple ideas, how to improve finder coupled tests:
- use AST for detect common peace of code (variables, functions, etc...)
Metadata
Release files for pytest-sherlock 0.2.4
For a detailed explanation of source distributions (sdists) and built distributions (wheels), please see the package formats documentation.
Source distribution (sdist)
| File | Size | Uploaded | |
|---|---|---|---|
| pytest-sherlock-0.2.4.tar.gz | 15.6 kB | Details |
Built distribution (wheel)
| File | Interpreter | ABI | Platform | Reset |
|---|---|---|---|---|
| pytest_sherlock-0.2.4-py2.py3-none-any.whl | Python 2, Python 3 | none | any | Details |
Total release size: 24.9 kB
Release files / pytest-sherlock-0.2.4.tar.gz
| Download URL | pytest-sherlock-0.2.4.tar.gz |
|---|---|
| Size | 15.6 kB |
| Tags | Source |
|
SHA-256 checksum How to use checksums |
8d1544e41a08317ef716c468e6900843e8e9875c01cc91a9dc58a819d545e406
|
|
BLAKE2b-256 checksum How to use checksums |
6ac1ba866a684bdf0c7560c66cf2c0f2e56807c16fab9bf8887ec4a1f023ad4f
|
| Upload date | |
|
Uploaded using Trusted Publishing? What is trusted publishing? |
No |
| Uploaded via |
twine/3.6.0 importlib_metadata/4.8.2 pkginfo/1.7.1 requests/2.26.0 requests-toolbelt/0.9.1 tqdm/4.62.3 CPython/3.7.12
|
Release files / pytest_sherlock-0.2.4-py2.py3-none-any.whl
| Download URL | pytest_sherlock-0.2.4-py2.py3-none-any.whl |
|---|---|
| Size | 9.2 kB |
| Tags | Python 2 Python 3 |
|
SHA-256 checksum How to use checksums |
259c0072499093ea750221658a1d0aaf7bc2042d4af016a908306dc12937a4de
|
|
BLAKE2b-256 checksum How to use checksums |
3070e63d229fe16faa43dc20827b6b02fa238569d4a9543145347129afb55771
|
| Upload date | |
|
Uploaded using Trusted Publishing? What is trusted publishing? |
No |
| Uploaded via |
twine/3.6.0 importlib_metadata/4.8.2 pkginfo/1.7.1 requests/2.26.0 requests-toolbelt/0.9.1 tqdm/4.62.3 CPython/3.7.12
|