pytest-queryguard
A pytest plugin that fails tests with N+1 queries and enforces query budgets for SQLAlchemy 2, in sync, async and FastAPI code. On PostgreSQL 16 and newer it can also fail tests whose queries have no index to use.
Why
ORM code that looks correct can send one query per row instead of one query per page. These are N+1 queries: one query for the list, then one more for each row:
orders = session.scalars(select(Order)).all() # 1 query
for order in orders:
print(order.customer.name) # +1 query per order
The tests pass. A test database holds a handful of rows, so 5 extra queries cost nothing. In production the same endpoint loads 500 orders, sends 501 queries and gets slow. Nothing in the test run warned you.
pytest-queryguard watches the SQL each test sends. When it sees the N+1 pattern, it fails the test and points to the line that caused it, even if the test database has only a few rows.
Before and after
The code below is a small example project. All output in this section is copied from a real run.
app/orders.py:
from sqlalchemy import select
from sqlalchemy.orm import Session
from app.models import Order
def list_orders(session: Session) -> list[dict[str, object]]:
orders = session.scalars(select(Order)).all()
return [{"id": order.id, "customer": order.customer.name} for order in orders]
app/customers.py:
from sqlalchemy.orm import Session
from app.models import Customer
def fetch_customers(session: Session, ids: list[int]) -> list[Customer]:
customers = []
for customer_id in ids:
customers.append(session.get(Customer, customer_id))
return customers
def rename_customers(session: Session, names: dict[int, str]) -> None:
for customer_id, name in names.items():
session.get(Customer, customer_id).name = name
session.flush()
tests/test_orders.py (the session fixture in tests/conftest.py
creates 50 customers with one order each; tests/__init__.py exists, so
pytest puts the project root on sys.path and app can be imported):
import pytest
from app.customers import fetch_customers, rename_customers
from app.orders import list_orders
def test_list_orders(session):
assert len(list_orders(session)) == 50
def test_fetch_customers(session):
assert len(fetch_customers(session, list(range(1, 51)))) == 50
@pytest.mark.max_queries(2)
def test_rename_customers(session):
rename_customers(session, {1: "Ada", 2: "Grace"})
All three tests pass without the plugin. With it installed,
pytest --queryguard-report gives the output below. It comes from Python
3.13 with SQLAlchemy 2.1; Python 3.12 prints the same. Older versions print
slightly different SQL or function names, for example in <listcomp> on
Python 3.10 and 3.11, or column aliases in the SQL on SQLAlchemy 2.0.
tests/test_orders.py FFF [100%]
=================================== FAILURES ===================================
_______________________________ test_list_orders _______________________________
queryguard: N+1 detected
Order.customer was lazy-loaded 50 times
first at app/orders.py:9 in list_orders
sql: SELECT customer.id, customer.name FROM customer WHERE customer.id = ?
fix: load it with the parent query, e.g.
select(Order).options(selectinload(Order.customer))
_____________________________ test_fetch_customers _____________________________
queryguard: N+1 detected
the same statement ran 50 times
first at app/customers.py:9 in fetch_customers
SELECT customer.id, customer.name FROM customer WHERE customer.id = ?
fix: fetch all rows in one query (WHERE id IN (...)) instead of in a loop
____________________________ test_rename_customers _____________________________
queryguard: expected at most 2 queries, got 4
1. SELECT customer.id, customer.name FROM customer WHERE customer.id = ? (app/customers.py:15 in rename_customers)
2. UPDATE customer SET name=? WHERE customer.id = ? (app/customers.py:16 in rename_customers)
3. SELECT customer.id, customer.name FROM customer WHERE customer.id = ? (app/customers.py:15 in rename_customers)
4. UPDATE customer SET name=? WHERE customer.id = ? (app/customers.py:16 in rename_customers)
============================== queryguard report ===============================
51 tests/test_orders.py::test_list_orders
50 tests/test_orders.py::test_fetch_customers
4 tests/test_orders.py::test_rename_customers
=========================== short test summary info ============================
FAILED tests/test_orders.py::test_list_orders - Failed: queryguard: N+1 detected
FAILED tests/test_orders.py::test_fetch_customers - Failed: queryguard: N+1 d...
FAILED tests/test_orders.py::test_rename_customers - Failed: queryguard: expe...
============================== 3 failed in 0.07s ===============================
The fixed code loads related rows with the parent query and fetches many
rows with one IN query.
app/orders.py, fixed:
from sqlalchemy import select
from sqlalchemy.orm import Session, selectinload
from app.models import Order
def list_orders(session: Session) -> list[dict[str, object]]:
orders = session.scalars(select(Order).options(selectinload(Order.customer))).all()
return [{"id": order.id, "customer": order.customer.name} for order in orders]
app/customers.py, fixed:
from collections.abc import Sequence
from sqlalchemy import select
from sqlalchemy.orm import Session
from app.models import Customer
def fetch_customers(session: Session, ids: list[int]) -> Sequence[Customer]:
return session.scalars(select(Customer).where(Customer.id.in_(ids))).all()
def rename_customers(session: Session, names: dict[int, str]) -> None:
customers = session.scalars(select(Customer).where(Customer.id.in_(names)))
for customer in customers:
customer.name = names[customer.id]
session.flush()
The same tests, unchanged:
tests/test_orders.py ... [100%]
============================== queryguard report ===============================
2 tests/test_orders.py::test_list_orders
2 tests/test_orders.py::test_rename_customers
1 tests/test_orders.py::test_fetch_customers
============================== 3 passed in 0.04s ===============================
Install
pip install pytest-queryguard
It needs Python 3.10 or newer, pytest 8 or newer and SQLAlchemy 2.0 or newer. The plugin registers itself with pytest. There is nothing to import or configure.
Usage
Automatic N+1 detection
Every test is checked. A test fails when, inside the test function:
- one relationship (for example
Order.customer) is lazy-loaded for 2 or more different parent objects, or - one
SELECT, with its parameters and literals removed, runs 5 or more times.
Both thresholds can be changed (see Configuration).
Query budgets with the max_queries marker
import pytest
@pytest.mark.max_queries(3)
def test_order_page(client):
client.get("/orders/1")
@pytest.mark.max_queries(n=3) # the same, with a keyword
def test_order_page_again(client):
client.get("/orders/1")
The test fails when its body runs more SQL statements than the limit. The
failure lists every statement with the line that issued it. Budgets count
all statements, writes included, and they always fail, whatever
queryguard_mode is set to. If the test already fails on its own, an
exceeded budget is not reported, because the original failure wins.
Query budgets with the max_queries() context manager
from pytest_queryguard import max_queries
def test_checkout(service, cart):
with max_queries(2):
service.checkout(cart)
Only the statements inside the with block count. Above the limit it raises
QueryBudgetExceeded, a subclass of AssertionError. The context manager
does not depend on pytest, so it also works in a script or a benchmark. It
checks the budget only; N+1 detection is done by the plugin around the
whole test.
Reading the queries in a test
record_queries() records the SQL statements a block sends and lets the
test read them back:
from pytest_queryguard import record_queries
from app.customers import fetch_customers
from app.orders import list_orders
def test_list_orders_loads_customers_with_the_orders(session):
with record_queries() as log:
list_orders(session)
assert log.count == 2
assert log.queries[1].sql.startswith("SELECT customer.id")
assert log.queries[1].relationship == "Order.customer"
def test_fetch_customers(session):
with record_queries() as log:
fetch_customers(session, [1, 2, 3])
log.assert_no_nplusone(repeat_threshold=2)
log.queries is a tuple of Query objects, in the order the statements
ran. The log is also sized, iterable and indexable (len(log),
for query in log, log[i] and log[a:b]) but not a
collections.abc.Sequence, because log.count is a number and not the
count(value) method of a sequence. An empty log is falsy. Each Query has:
sql: the statement as SQLAlchemy sent it to the driver;callsite: aCallSitewithfilename,linenoandfunction, the first frame outside SQLAlchemy, pytest, the standard library,site-packagesand the plugin, orNone;relationship: the relationship the statement loaded, lazily or as the extra query ofselectinload, such as"Order.customer", orNone.
log.count is the number of statements. Both grow inside the block and
stay fixed after it. Statements from other threads are recorded too.
QueryLog is not constructible by users: record_queries() is the only way
to get one, and its constructor may change in any release. Use the class for
type hints only.
log.assert_no_nplusone() applies the plugin's two N+1 rules to the
block. It raises NPlusOneDetected, a subclass of AssertionError, with
the plugin's message, with paths relative to pytest's rootdir (outside
pytest, to the working directory). The thresholds are keyword arguments,
relationship_threshold=2 and repeat_threshold=5 by default, the same
defaults as the ini options.
It does not read the ini options, queryguard_mode or the allow_nplusone
marker; calling it is an explicit request. A project that sets
queryguard_repeat_threshold = 10 in its configuration therefore has to pass
repeat_threshold=10 here as well, or the helper keeps using 5 (the same for
queryguard_relationship_threshold and relationship_threshold). With the
fetch_customers loop from Before and after, the
plugin accepts 3 lookups, because its threshold is 5, while the stricter
call above does not (pytest --tb=short, Python 3.13, SQLAlchemy 2.1):
tests/test_queries.py .F [100%]
=================================== FAILURES ===================================
_____________________________ test_fetch_customers _____________________________
tests/test_queries.py:18: in test_fetch_customers
log.assert_no_nplusone(repeat_threshold=2)
E pytest_queryguard.api.NPlusOneDetected: queryguard: N+1 detected
E
E the same statement ran 3 times
E first at app/customers.py:9 in fetch_customers
E SELECT customer.id, customer.name FROM customer WHERE customer.id = ?
E fix: fetch all rows in one query (WHERE id IN (...)) instead of in a loop
=========================== short test summary info ============================
FAILED tests/test_queries.py::test_fetch_customers - pytest_queryguard.api.NP...
========================= 1 failed, 1 passed in 0.05s ==========================
If pytest-queryguard hits an internal error, it stops recording and issues a
QueryGuardInternalWarning. A record_queries() block that ends after such
an error then warns that its log may be incomplete (the warning class is
exported from pytest_queryguard), and log.assert_no_nplusone() raises
RuntimeError instead of passing on a log that may be empty. This also holds
outside pytest and with --queryguard-mode=off. The warning is issued when
the block ends normally; a block left by an exception does not warn, so the
warning never replaces the exception, but its log is still fixed at that
point and assert_no_nplusone() still refuses it.
What is public API in 0.x:
- the functions and classes
max_queries()(and itsValueErrorfor a bad limit),QueryBudgetExceeded,record_queries(),QueryLog(its properties and methods, not its constructor),QueryandCallSite(their fields, not their constructors, which are keyword-only and may change),NPlusOneDetected,QueryGuardWarningandQueryGuardInternalWarning; - the markers
max_queries(n),allow_nplusoneandallow_missing_index(*tables); - the ini options
queryguard_mode,queryguard_relationship_threshold,queryguard_repeat_threshold,queryguard_index_checkandqueryguard_index_ignore_tables; - the command-line flags
--queryguard-mode,--queryguard-report,--queryguard-index-checkand--no-queryguard-index-check.
What is not: the constructors of QueryLog, Query and CallSite, and the
object with max_queries(n) as c yields. That object is still the internal
collector in 0.x, kept as it was in 0.2, and may change in any release. Use
record_queries() to read the queries.
Recording changes nothing else. The plugin's N+1 detection, budgets and
index check see the same statements, and record_queries() combines with
max_queries(): with max_queries(3), record_queries() as log:. Like
max_queries(), it also works outside pytest.
Opting out
@pytest.mark.allow_nplusone
def test_legacy_report(session): ...
The test is not checked for N+1. A max_queries marker on the same test is
still enforced.
Async and FastAPI
Nothing changes for async code. AsyncSession and create_async_engine run
on a sync engine underneath, which the plugin already watches. On SQLAlchemy
2.1 and newer, async support needs pip install "sqlalchemy[asyncio]",
which provides greenlet. The failure
points to the await in your code, not to SQLAlchemy internals:
# app/orders.py; the models use SQLAlchemy's AsyncAttrs mixin.
async def customer_names(session: AsyncSession) -> list[str]:
orders = (await session.scalars(select(Order))).all()
return [(await order.awaitable_attrs.customer).name for order in orders]
# tests/test_async.py; main() creates the engine and data, then calls
# customer_names(session).
def test_customer_names():
asyncio.run(main())
This fails with Order.customer was lazy-loaded 3 times, first at the line
with the await. pytest cannot run async def tests by itself. With
pytest-asyncio or anyio you can write the test as async def instead of
calling asyncio.run.
FastAPI's TestClient runs the application in another thread. Queries from
any thread are counted, so an N+1 inside an endpoint fails the test that
called it:
def test_orders_endpoint(client):
assert client.get("/orders").status_code == 200
Session report
pytest --queryguard-report prints, at the end of the run, the 10 tests
that ran the most queries, failing tests included. See the output in
Before and after.
Missing indexes (PostgreSQL 16 and newer)
A test database holds a few rows, so a query that reads the whole table is
as fast in CI as one that uses an index. The missing index shows up in
production, once the table has grown. With the index check on, every
SELECT in a test body is planned again by PostgreSQL with sequential scans
switched off. If the plan still reads a whole table, or a whole index, to
apply the statement's filter, no index can serve that filter, however small
the table, and the test fails.
The check is off by default. Turn it on for a run:
pytest --queryguard-index-check
or for the project, with queryguard_index_check = true (see
Configuration).
The example below uses a real PostgreSQL 17 server through pg8000. All output is copied from a run with Python 3.13, SQLAlchemy 2.1 and pytest 9.1.
app/models.py:
class Order(Base):
__tablename__ = "orders"
id: Mapped[int] = mapped_column(primary_key=True)
customer_id: Mapped[int] = mapped_column(ForeignKey("customer.id"))
app/orders.py:
def orders_of(session: Session, customer_id: int) -> Sequence[Order]:
stmt = select(Order).where(Order.customer_id == customer_id)
return session.scalars(stmt).all()
tests/test_orders.py (the session fixture creates the tables in
PostgreSQL and adds 6 orders):
def test_orders_of(session):
assert len(orders_of(session, 1)) == 3
pytest --queryguard-index-check:
tests/test_orders.py F [100%]
=================================== FAILURES ===================================
________________________________ test_orders_of ________________________________
queryguard: missing index
orders is read in full: Seq Scan with filter (orders.customer_id = $1)
first at app/orders.py:11 in orders_of
sql: SELECT orders.id, orders.customer_id FROM orders WHERE orders.customer_id = %s::INTEGER
fix: CREATE INDEX ON orders (customer_id)
a sequential scan is fine on a small lookup table:
list it in queryguard_index_ignore_tables
=========================== short test summary info ============================
FAILED tests/test_orders.py::test_orders_of - Failed: queryguard: missing index
============================== 1 failed in 0.27s ===============================
With mapped_column(ForeignKey("customer.id"), index=True) the same test
passes:
tests/test_orders.py . [100%]
============================== 1 passed in 0.19s ===============================
Async engines with asyncpg are checked the same way, on the test's own connection and transaction. Rows and tables the test has not committed are visible to the check. The same model, with the query in async code:
async def orders_of(session: AsyncSession, customer_id: int) -> Sequence[Order]:
stmt = select(Order).where(Order.customer_id == customer_id)
return (await session.scalars(stmt)).all()
With a test that adds 6 orders in an uncommitted AsyncSession on
postgresql+asyncpg:// and calls orders_of(session, 1) through
asyncio.run, pytest --queryguard-index-check prints (Python 3.13,
SQLAlchemy 2.1, asyncpg 0.31, PostgreSQL 17):
________________________________ test_orders_of ________________________________
queryguard: missing index
orders is read in full: Seq Scan with filter (orders.customer_id = $1)
first at app/orders.py:11 in orders_of
sql: SELECT orders.id, orders.customer_id FROM orders WHERE orders.customer_id = $1::INTEGER
fix: CREATE INDEX ON orders (customer_id)
a sequential scan is fine on a small lookup table:
list it in queryguard_index_ignore_tables
Other async drivers, such as psycopg's async mode, are not checked; the session summary says so.
What is reported:
- a sequential scan with a filter: the
WHEREcondition has no index. Correlated subqueries andEXISTSshow up here too, through the filter of the subquery's scan; - a scan of a whole index with a filter that is an equality (
=orIN) on one column and no index condition. The planner picks it forWHERE customer_id = ? ORDER BY id LIMIT 10to avoid the sequential scan. Pagination with a range orIS NULLfilter (WHERE total > 0 ORDER BY id LIMIT 20) walks the primary key on purpose and is not reported. A whole index read as a bitmap, which PostgreSQL may choose beforeANALYZEfor anINCLUDEindex or a partial index (... WHERE deleted_at IS NULL), counts the same way. A bitmap that combines several indexes (OR, orANDof indexed columns) is not reported; - an index condition, an equality on one column, that leaves out the first
column of a multicolumn btree index: with only an index on
(tenant_id, status),WHERE status = ?reads the whole index on PostgreSQL 16 and 17. PostgreSQL 18 can skip-scan such an index, so this case is not checked there. BRIN and GIN indexes serve any of their columns and are not judged this way.
Not reported: a sequential scan without a filter, such as SELECT * FROM t,
SELECT count(*) FROM t or a join without a WHERE, because the statement
reads the whole table anyway; scans of PostgreSQL's own catalogs. Whether a
join reads its unindexed side in full depends on table statistics, so join
conditions on their own are never reported.
The fix: line names a column only when the condition compares one plain
column with =, <, <=, > or >=. PostgreSQL prints a ::text cast
for varchar columns compared with text, which an index on the column
still serves, so the check reads the column types from the catalog and
accepts that cast for varchar columns only. A column inside a function or
another cast, such as total::int = ?, or id::text = ? on an integer,
enum or char(n) column, gets
add an index that matches this condition (an expression index may be needed),
because an index on the plain column would not help there.
Each distinct statement is explained once per test (again after DDL changes the catalog), inside a savepoint on the connection that ran it, so the check sees tables and rows the test has not committed yet and leaves the test's transaction as it was. Statements from fixtures are not checked, like for N+1 detection. Statements that start with comments, such as sqlcommenter tags, are checked too.
The check costs a few database round trips per distinct statement per test:
open the savepoint, set the planner settings, EXPLAIN and roll back. The
first column of the btree indexes a plan uses and the varchar columns of
tables cast to text are read from the catalog once per engine for the whole
session. Any statement that may change them, such as CREATE INDEX,
DROP TABLE or ALTER TABLE, clears that cache, in a test or a fixture,
and so does the end of a transaction that ran one. A suite that runs
create_all and drop_all around every test therefore clears the cache
every test and gets no speed-up from it. With pg8000 against
PostgreSQL 17 in a local Docker container, a suite of 100 tests that each
run the same 10 indexed statements on a session-scoped engine
(scripts/bench_index_check.py) took
1.2–1.8 s without the check and 2.0–2.9 s with it, over 12 runs: about
1 ms per statement. Most of that is round-trip time, so it is lower with a
faster connection to the database.
A sequential scan is the right plan for a small lookup table, also in
production. Exclude such tables with queryguard_index_ignore_tables, one
test with @pytest.mark.allow_missing_index, or only some tables in one
test with @pytest.mark.allow_missing_index("countries", "currencies").
Findings follow queryguard_mode: warn turns them into warnings and
off turns the check off. allow_nplusone does not affect the index check.
Statements that cannot be checked do not fail the test. They are summed up once at the end of the session, for example with SQLite:
============================ queryguard index check ============================
sqlite statements were not checked: the index check needs PostgreSQL 16 or newer
The same summary names a PostgreSQL server older than 16, async drivers other than asyncpg, and the number of statements PostgreSQL could not plan, with the first error and its SQL.
Configuration
| Option | Values | Default | Meaning |
|---|---|---|---|
queryguard_mode |
fail, warn, off |
fail |
fail fails a test with N+1. warn reports it as a QueryGuardWarning and lets the test pass. off turns detection off; tests without a budget are not measured. |
queryguard_relationship_threshold |
integer ≥ 2 | 2 |
Number of different parent objects for which one relationship must be lazy-loaded to count as N+1. |
queryguard_repeat_threshold |
integer ≥ 2 | 5 |
Number of times one normalized SELECT must run to count as N+1. |
queryguard_index_check |
true, false |
false |
Checks each SELECT for a missing index (PostgreSQL 16 or newer). |
queryguard_index_ignore_tables |
table names or fnmatch patterns, one per line |
empty | Tables the index check ignores. A pattern matches table or schema.table, for example countries, lookup_* or audit.*. |
Any invalid value stops pytest with a usage error.
In pyproject.toml:
[tool.pytest.ini_options]
queryguard_mode = "warn"
queryguard_relationship_threshold = 3
queryguard_repeat_threshold = 10
queryguard_index_check = true
queryguard_index_ignore_tables = ["countries", "lookup_*"]
With pytest 9 you can use the native TOML table instead:
[tool.pytest]
queryguard_mode = "warn"
queryguard_relationship_threshold = 3
queryguard_repeat_threshold = 10
queryguard_index_check = true
queryguard_index_ignore_tables = ["countries", "lookup_*"]
pytest.ini and setup.cfg work as usual.
The warning classes, pytest_queryguard.QueryGuardWarning for N+1 and
missing indexes in warn mode and
pytest_queryguard.QueryGuardInternalWarning for an internal error, work
with pytest's usual warning filters. For example, to turn these warnings
back into failures for one job:
[tool.pytest.ini_options]
queryguard_mode = "warn"
filterwarnings = ["error::pytest_queryguard.QueryGuardWarning"]
Command-line options:
| Option | Meaning |
|---|---|
--queryguard-mode=fail|warn|off |
Overrides queryguard_mode for this run. |
--queryguard-report |
Prints the 10 tests with the most queries at the end of the session. |
--queryguard-index-check |
Turns the missing-index check on for this run. |
--no-queryguard-index-check |
Turns the missing-index check off for this run, whatever queryguard_index_check says. |
How it works
- When pytest starts (unless
queryguard_mode = off; budgets still install the listeners when a test needs them), the plugin adds two class-level SQLAlchemy listeners:do_orm_executeonSessionsees relationship lazy loads, andbefore_cursor_executeonEnginesees every SQL statement. - Measurement covers only the test function body, so queries in fixture setup and teardown are not counted.
- Each statement is stored with the first stack frame outside SQLAlchemy,
pytest, the standard library,
site-packagesand the plugin itself. For async sessions the search continues in the parent greenlets, where the awaiting code runs. - With the index check on, an
after_cursor_executelistener runs, on the same connection and inside a savepoint,SET LOCAL enable_seqscan = off(throughset_config) andEXPLAIN (GENERIC_PLAN, VERBOSE, FORMAT JSON)for each newSELECT, with the driver's placeholders rewritten to$1,$2, ..., then rolls back to the savepoint. The SQL goes through a raw DB-API cursor, so SQLAlchemy events, budgets and your own listeners do not see it. asyncpg prepares the statements it reads rows from, and PostgreSQL would then take the$1as a parameter of theEXPLAINitself. With asyncpg, theEXPLAINtherefore runs inside a PL/pgSQLDOblock. The block stores the plan in a setting local to the savepoint (queryguard.plan), and a plainSELECTreads it back. These statements go to the raw asyncpg connection through SQLAlchemy'srun_async(). - After the test, the recorded events are checked against the budget, the two N+1 rules and the scans found by the index check. A bug inside the plugin disables it with one warning; it never fails your tests.
Limitations
- SQLAlchemy only. Raw DB-API connections and other ORMs are not seen.
- Everything in
site-packagescounts as library code. If your application is installed non-editable (for examplepip install .in a Docker CI image), its frames are skipped too, and call sites point to the test file instead of the application line. - One measurement is active per process at a time, so tests in one process
must run sequentially. Under pytest-xdist each worker measures its own
tests, so detection and budgets work. The report needs a single process,
so under pytest-xdist it prints
queryguard report: not available with pytest-xdist. - Tests that use
pytesterto run pytest in-process are also measured by the outer test, which sees the inner run's queries. Mark such tests withallow_nplusoneor usepytester.runpytest_subprocess(). - unittest
setUpandtearDownrun inside the test call, so their queries are counted, unlike pytest fixtures. - A non-strict
xfailtest that has an N+1 is reported as xfailed rather than XPASS, because the N+1 failure looks like the expected failure. INSERT,UPDATEandDELETEare never reported as N+1. At cursor level a unit-of-work flush cannot be told apart from an application write, so all writes are left out. Use a budget to catch write loops.- The index check needs PostgreSQL 16 or newer, and a sync engine or an
async engine on asyncpg. Other async drivers, such as psycopg's async
mode, are skipped with a notice. The test suite uses pg8000 and asyncpg.
psycopg2 and psycopg 3 were checked by hand during review and give the
same findings for plain statements,
%in SQL, expandingIN, autocommit andstream_results; they are LGPL-licensed, so this project does not depend on them or run them in CI. - On asyncpg the check needs PL/pgSQL, which PostgreSQL installs by
default. Without it, each statement is counted as one PostgreSQL could
not plan. After the first check, the connection knows the custom setting
queryguard.plan, with an empty value:current_setting('queryguard.plan')returns''there instead of an error. - The index check looks only at
SELECTandWITHstatements and judges plans, not data: it says that no index can serve a filter, not that an existing index is a good one. A missing index that only a join would use (a join without aWHEREon that table) is not reported, because the plan for it depends on statistics. - A partitioned table is reported under the partition's name, and
queryguard_index_ignore_tablesmatches partition names, not the parent table's. - The index check clears its catalog cache on DDL it sees through
SQLAlchemy in the same process. DDL run another way while the session
runs, through a raw DB-API connection,
psql, another process or a function called from aSELECT, is not seen, and the check may judge an index by its old definition. A fresh pytest session starts with an empty cache. - The index check's session summary is printed by the process that runs the tests, so under pytest-xdist it is not shown. Findings in tests are reported as usual.
- On pytest 9.0 and 9.1, a wrongly typed value in the native
[tool.pytest]table for one of pytest's own options (for exampleconsole_output_style = 3) stops pytest with an internal error, with or without this plugin. Wrong types for this plugin's options are reported as usage errors.
Comparison with nplusone
nplusone solved the same problem earlier and also covers Django and Peewee. Its last release, 1.0.0, came out in 2018, and it does not support SQLAlchemy 2. pytest-queryguard targets SQLAlchemy 2 only, including async sessions, and adds query budgets and a fix hint in the failure message. It does not detect unused eager loads, which nplusone does.
Roadmap
- 0.2.0 (released): missing index detection on PostgreSQL 16 and newer, see Missing indexes.
- 0.3.0: the missing-index check on asyncpg engines, see
Missing indexes;
record_queries()andQueryLogfor reading the queries of a block, see Reading the queries in a test; the index check's catalog lookups cached per session; fixes for temporary tables and partial indexes. - Later: Django ORM support.
Development
The project uses uv.
uv sync
uv run coverage run -m pytest
uv run coverage report
uv run ruff check .
uv run ruff format --check .
uv run mypy src
The PostgreSQL tests run when QUERYGUARD_PG_URL points to a server, and
are skipped otherwise. The async tests reach the same server through
asyncpg:
docker run -d --rm --name qg-postgres -p 55432:5432 -e POSTGRES_PASSWORD=pg postgres:17
QUERYGUARD_PG_URL=postgresql+pg8000://postgres:pg@localhost:55432/postgres uv run pytest
docker stop qg-postgres
Coverage is measured with coverage run rather than pytest --cov, because
--cov starts after pytest has imported the plugin and misses its
import-time lines.
License
MIT, see the LICENSE file.
Metadata
Release files for pytest-queryguard 0.3.0
For a detailed explanation of source distributions (sdists) and built distributions (wheels), please see the package formats documentation.
Source distribution (sdist)
| File | Size | Uploaded | |
|---|---|---|---|
| pytest_queryguard-0.3.0.tar.gz | 114.5 kB | Details |
Built distribution (wheel)
| File | Interpreter | ABI | Platform | Reset |
|---|---|---|---|---|
| pytest_queryguard-0.3.0-py3-none-any.whl | Python 3 | none | any | Details |
Total release size: 160.4 kB
Release files / pytest_queryguard-0.3.0.tar.gz
| Download URL | pytest_queryguard-0.3.0.tar.gz |
|---|---|
| Size | 114.5 kB |
| Tags | Source |
|
SHA-256 checksum How to use checksums |
8a90d115a7d317f0c0bc935d85d22f5f6e14cf9ac1bf701c89262fbcdeddb3b6
|
|
BLAKE2b-256 checksum How to use checksums |
7536840d0065620d5031aacb0d6e90f9ebae7a61b3f9b47803a1d57b09c312de
|
| Upload date | |
|
Uploaded using Trusted Publishing? What is trusted publishing? |
Yes |
| Uploaded via |
twine/7.0.0 CPython/3.13.14
|
Provenance
Provenance describes where a file came from. On PyPI, provenance is shared via attestations, which provide a verifiable record of the build or publishing details. View details, limitations and caveats.
PyPI Publish Attestation
PyPI verified that this artifact, at this checksum, originated from the publisher listed below.
Signed by GitHub Actions, verified by PyPI on Oct 11, 2026.
Transparency logRelease files / pytest_queryguard-0.3.0-py3-none-any.whl
| Download URL | pytest_queryguard-0.3.0-py3-none-any.whl |
|---|---|
| Size | 45.8 kB |
| Tags | Python 3 |
|
SHA-256 checksum How to use checksums |
d60460458f2652394db945db6adc801d7d64601e2bba2a8b80f28ae5faf8c0c9
|
|
BLAKE2b-256 checksum How to use checksums |
3e05c8e942a328173134e95c3a52fac62dd3dcfc7ac21d3bcc297c9d5f14f7d3
|
| Upload date | |
|
Uploaded using Trusted Publishing? What is trusted publishing? |
Yes |
| Uploaded via |
twine/7.0.0 CPython/3.13.14
|
Provenance
Provenance describes where a file came from. On PyPI, provenance is shared via attestations, which provide a verifiable record of the build or publishing details. View details, limitations and caveats.
PyPI Publish Attestation
PyPI verified that this artifact, at this checksum, originated from the publisher listed below.
Signed by GitHub Actions, verified by PyPI on Oct 11, 2026.
Transparency log